Reaction Details
TargetD(3) dopamine receptor
LigandBDBM50343798
Substrate/Competitorn/a
Meas. Tech.ChEMBL_747598 (CHEMBL1777179)
Ki 1.5±n/a nM
Citation Banala, AKLevy, BAKhatri, SSFurman, CARoof, RAMishra, YGriffin, SASibley, DRLuedtke, RRNewman, AH N-(3-fluoro-4-(4-(2-methoxy or 2,3-dichlorophenyl)piperazine-1-yl)butyl)arylcarboxamides as selective dopamine D3 receptor ligands: critical role of the carboxamide linker for D3 receptor selectivity. J Med Chem54:3581-94 (2011) 
 
D(3) dopamine receptor
Name:D(3) dopamine receptor
Type:n/a
Mol. Mass.:44243.43
Organism:Homo sapiens (Human)
Description:n/a
Residue:400
BDBM50343798
NameBDBM50343798
Synonyms:CHEMBL1774541 | N-(4-(4-(2,3-Dichlorophenyl)piperazin-1-yl)-3-fluorobutyl)-5-methoxy-1H-indole-2-carboxamide
TypeSmall organic molecule
Emp. Form.C24H27Cl2FN4O2
Mol. Mass.493.401
SMILESCOc1ccc2[nH]c(cc2c1)C(=O)NCCC(F)CN1CCN(CC1)c1cccc(Cl)c1Cl