Reaction Details
TargetD(3) dopamine receptor
LigandBDBM50119384
Substrate/Competitorn/a
Meas. Tech.ChEMBL_747598 (CHEMBL1777179)
Ki 0.8±n/a nM
Citation Banala, AKLevy, BAKhatri, SSFurman, CARoof, RAMishra, YGriffin, SASibley, DRLuedtke, RRNewman, AH N-(3-fluoro-4-(4-(2-methoxy or 2,3-dichlorophenyl)piperazine-1-yl)butyl)arylcarboxamides as selective dopamine D3 receptor ligands: critical role of the carboxamide linker for D3 receptor selectivity. J Med Chem54:3581-94 (2011) 
 
D(3) dopamine receptor
Name:D(3) dopamine receptor
Type:n/a
Mol. Mass.:44243.43
Organism:Homo sapiens (Human)
Description:n/a
Residue:400
BDBM50119384
NameBDBM50119384
Synonyms:Benzofuran-2-carboxylic acid {4-[4-(2,3-dichloro-phenyl)-piperazin-1-yl]-butyl}-amide N-(4-(4-(2,3-dichlorophenyl)piperazin-1-yl)butyl)benzofuran-2-carboxamide
TypeSmall organic molecule
Emp. Form.C23H25Cl2N3O2
Mol. Mass.446.37
SMILESClc1cccc(N2CCN(CCCCNC(=O)c3cc4ccccc4o3)CC2)c1Cl