Reaction Details
TargetD(3) dopamine receptor
LigandBDBM50343794
Substrate/Competitorn/a
Meas. Tech.ChEMBL_747597 (CHEMBL1777178)
IC50 800±n/a nM
Citation Banala, AKLevy, BAKhatri, SSFurman, CARoof, RAMishra, YGriffin, SASibley, DRLuedtke, RRNewman, AH N-(3-fluoro-4-(4-(2-methoxy or 2,3-dichlorophenyl)piperazine-1-yl)butyl)arylcarboxamides as selective dopamine D3 receptor ligands: critical role of the carboxamide linker for D3 receptor selectivity. J Med Chem54:3581-94 (2011) 
 
D(3) dopamine receptor
Name:D(3) dopamine receptor
Type:n/a
Mol. Mass.:44243.43
Organism:Homo sapiens (Human)
Description:n/a
Residue:400
BDBM50343794
NameBDBM50343794
Synonyms:CHEMBL1774537 | N-(4-(4-(2,3-Dichlorophenyl)piperazin-1-yl)-3-fluorobutyl)-9H-fluorene-2-carboxamide
TypeSmall organic molecule
Emp. Form.C28H28Cl2FN3O
Mol. Mass.512.446
SMILESFC(CCNC(=O)c1ccc-2c(Cc3ccccc-23)c1)CN1CCN(CC1)c1cccc(Cl)c1Cl