Reaction Details
TargetTyrosine-protein kinase Fyn
LigandBDBM50343938
Substrate/Competitorn/a
Meas. Tech.ChEMBL_748307 (CHEMBL1781317)
Ki 28±n/a nM
Citation Ando, RIkegami, HSakiyama, MOoike, SHayashi, MFujino, YAbe, DNakamura, HMishina, TKato, HIwase, YTomozane, HMorioka, M 3-Cyano-6-(5-methyl-3-pyrazoloamino)pyridines: selective Aurora A kinase inhibitors. Bioorg Med Chem Lett20:4709-11 (2010) 
 
Tyrosine-protein kinase Fyn
Name:Tyrosine-protein kinase Fyn
Type:Enzyme
Mol. Mass.:60762.21
Organism:Homo sapiens (Human)
Description:P06241
Residue:537
BDBM50343938
NameBDBM50343938
Synonyms:CHEMBL1778662 | rac-2-(6-hydroxy-6-methylheptan-2-ylamino)-4-methyl-6-(5-methyl-1H-pyrazol-3-ylamino)nicotinonitrile hydrochloride
TypeSmall organic molecule
Emp. Form.C19H28N6O
Mol. Mass.356.4652
SMILESCC(CCCC(C)(C)O)Nc1nc(Nc2cc(C)n[nH]2)cc(C)c1C#N