Reaction Details
TargetAurora kinase A
LigandBDBM50343941
Substrate/Competitorn/a
Meas. Tech.ChEMBL_748278 (CHEMBL1781288)
Ki 3.8±n/a nM
Citation Ando, RIkegami, HSakiyama, MOoike, SHayashi, MFujino, YAbe, DNakamura, HMishina, TKato, HIwase, YTomozane, HMorioka, M 3-Cyano-6-(5-methyl-3-pyrazoloamino)pyridines: selective Aurora A kinase inhibitors. Bioorg Med Chem Lett20:4709-11 (2010) 
 
Aurora kinase A
Name:Aurora kinase A
Type:Serine/threonine-protein kinase
Mol. Mass.:45830.98
Organism:Homo sapiens (Human)
Description:O14965
Residue:403
BDBM50343941
NameBDBM50343941
Synonyms:2-(hexylthio)-4-methyl-6-(5-methyl-1H-pyrazol-3-ylamino)nicotinonitrile | CHEMBL1780258
TypeSmall organic molecule
Emp. Form.C17H23N5S
Mol. Mass.329.463
SMILESCCCCCCSc1nc(Nc2cc(C)n[nH]2)cc(C)c1C#N