Reaction Details
TargetCytochrome P450 1A1
LigandBDBM23411
Substrate/Competitorn/a
Meas. Tech.ChEMBL_748492 (CHEMBL1780345)
Ki 1640±n/a nM
Citation Androutsopoulos, VPPapakyriakou, AVourloumis, DSpandidos, DA Comparative CYP1A1 and CYP1B1 substrate and inhibitor profile of dietary flavonoids. Bioorg Med Chem19:2842-9 (2011) 
 
Cytochrome P450 1A1
Name:Cytochrome P450 1A1
Type:Protein
Mol. Mass.:58177.23
Organism:Homo sapiens (Human)
Description:P04798
Residue:512
BDBM23411
NameBDBM23411
Synonyms:5,6,7-trihydroxy-2-(4-hydroxyphenyl)-4H-chromen-4-one Scutellarein Scutellarein (28) | US10252984, Table 2.2
Typeflavone
Emp. Form.C15H10O6
Mol. Mass.286.2363
SMILESOc1ccc(cc1)-c1cc(=O)c2c(O)c(O)c(O)cc2o1