Reaction Details
TargetCytochrome P450 1A1
LigandBDBM50134461
Substrate/Competitorn/a
Meas. Tech.ChEMBL_748492 (CHEMBL1780345)
Ki 630±n/a nM
Citation Androutsopoulos, VPPapakyriakou, AVourloumis, DSpandidos, DA Comparative CYP1A1 and CYP1B1 substrate and inhibitor profile of dietary flavonoids. Bioorg Med Chem19:2842-9 (2011) 
 
Cytochrome P450 1A1
Name:Cytochrome P450 1A1
Type:Protein
Mol. Mass.:58177.23
Organism:Homo sapiens (Human)
Description:P04798
Residue:512
BDBM50134461
NameBDBM50134461
Synonyms:2-(3-Hydroxy-4-methoxy-phenyl)-5,6,7-trimethoxy-chromen-4-one eupatorin-5-methylether
TypeSmall organic molecule
Emp. Form.C19H18O7
Mol. Mass.358.342
SMILESCOc1ccc(cc1O)-c1cc(=O)c2c(OC)c(OC)c(OC)cc2o1