Reaction Details
TargetNeprilysin
LigandBDBM50344194
Substrate/Competitorn/a
Meas. Tech.ChEMBL_748203 (CHEMBL1780284)
IC50 5±n/a nM
Citation Glossop, MSBazin, RJDack, KNFox, DNMacDonald, GAMills, MOwen, DRPhillips, CReeves, KARinger, TJStrang, RSWatson, CA Synthesis and evaluation of heteroarylalanine diacids as potent and selective neutral endopeptidase inhibitors. Bioorg Med Chem Lett21:3404-6 (2011) 
 
Neprilysin
Name:Neprilysin
Type:Enzyme
Mol. Mass.:85505.38
Organism:Homo sapiens (Human)
Description:P08473
Residue:750
BDBM50344194
NameBDBM50344194
Synonyms:(S)-2-(1-((S)-1-carboxy-2-(4-methyl-5-phenyloxazol-2-yl)ethylcarbamoyl)cyclopentylamino)-4-methoxybutanoic acid | CHEMBL1778533
TypeSmall organic molecule
Emp. Form.C24H31N3O7
Mol. Mass.473.5188
SMILESCOCC[C@H](NC1(CCCC1)C(=O)N[C@@H](Cc1nc(C)c(o1)-c1ccccc1)C(O)=O)C(O)=O