Reaction Details
TargetNeprilysin
LigandBDBM50344197
Substrate/Competitorn/a
Meas. Tech.ChEMBL_748203 (CHEMBL1780284)
IC50 1.9±n/a nM
Citation Glossop, MSBazin, RJDack, KNFox, DNMacDonald, GAMills, MOwen, DRPhillips, CReeves, KARinger, TJStrang, RSWatson, CA Synthesis and evaluation of heteroarylalanine diacids as potent and selective neutral endopeptidase inhibitors. Bioorg Med Chem Lett21:3404-6 (2011) 
 
Neprilysin
Name:Neprilysin
Type:Enzyme
Mol. Mass.:85505.38
Organism:Homo sapiens (Human)
Description:P08473
Residue:750
BDBM50344197
NameBDBM50344197
Synonyms:(S)-2-(1-((S)-1-carboxy-2-(3-phenyl-1,2,4-oxadiazol-5-yl)ethylcarbamoyl)cyclopentylamino)-4-methoxybutanoic acid | CHEMBL1778536
TypeSmall organic molecule
Emp. Form.C22H28N4O7
Mol. Mass.460.4803
SMILESCOCC[C@H](NC1(CCCC1)C(=O)N[C@@H](Cc1nc(no1)-c1ccccc1)C(O)=O)C(O)=O