Reaction Details
TargetNatriuretic peptides A
LigandBDBM50344189
Substrate/Competitorn/a
Meas. Tech.ChEMBL_748204 (CHEMBL1780285)
IC50 75±n/a nM
Citation Glossop, MSBazin, RJDack, KNFox, DNMacDonald, GAMills, MOwen, DRPhillips, CReeves, KARinger, TJStrang, RSWatson, CA Synthesis and evaluation of heteroarylalanine diacids as potent and selective neutral endopeptidase inhibitors. Bioorg Med Chem Lett21:3404-6 (2011) 
 
Natriuretic peptides A
Name:Natriuretic peptides A
Type:PROTEIN
Mol. Mass.:16393.93
Organism:Homo sapiens (Human)
Description:ChEMBL_748204
Residue:151
BDBM50344189
NameBDBM50344189
Synonyms:(S)-2-(1-((S)-1-carboxy-2-(4-isobutyloxazol-2-yl)ethylcarbamoyl)cyclopentylamino)pentanoic acid | CHEMBL1778528
TypeSmall organic molecule
Emp. Form.C21H33N3O6
Mol. Mass.423.5032
SMILESCCC[C@H](NC1(CCCC1)C(=O)N[C@@H](Cc1nc(CC(C)C)co1)C(O)=O)C(O)=O