Reaction Details
TargetPeroxisome proliferator-activated receptor alpha
LigandBDBM28681
Substrate/Competitorn/a
Meas. Tech.ChEMBL_747911 (CHEMBL1781230)
EC50>10000±n/a nM
Citation Sakuma, SEndo, TKanda, TNakamura, HYamasaki, SYamakawa, T Biological evaluation of novel benzisoxazole derivatives as PPARd agonists. Bioorg Med Chem19:3255-64 (2011) 
 
Peroxisome proliferator-activated receptor alpha
Name:Peroxisome proliferator-activated receptor alpha
Type:Enzyme
Mol. Mass.:52222.08
Organism:Homo sapiens (Human)
Description:Q07869
Residue:468
BDBM28681
NameBDBM28681
Synonyms:5-[(4-{2-[methyl(pyridin-2-yl)amino]ethoxy}phenyl)methyl]-1,3-thiazolidine-2,4-dione BRL 49653 CHEMBL121 [3H]rosiglitazone rosiglitazone
Typeradiolabeled ligand
Emp. Form.C18H19N3O3S
Mol. Mass.357.427
SMILESCN(CCOc1ccc(Cc2sc(=O)[nH]c2O)cc1)c1ccccn1