Reaction Details
TargetcAMP-specific 3',5'-cyclic phosphodiesterase 4B
LigandBDBM50344322
Substrate/Competitorn/a
Meas. Tech.ChEMBL_748499 (CHEMBL1780352)
IC50 29000±n/a nM
Citation Allcock, RWBlakli, HJiang, ZJohnston, KAMorgan, KMRosair, GMIwase, KKohno, YAdams, DR Phosphodiesterase inhibitors. Part 1: Synthesis and structure-activity relationships of pyrazolopyridine-pyridazinone PDE inhibitors developed from ibudilast. Bioorg Med Chem Lett21:3307-12 (2011) 
 
cAMP-specific 3',5'-cyclic phosphodiesterase 4B
Name:cAMP-specific 3',5'-cyclic phosphodiesterase 4B
Type:Protein
Mol. Mass.:83318.87
Organism:Homo sapiens (Human)
Description:Q07343
Residue:736
BDBM50344322
NameBDBM50344322
Synonyms:3-(6-chloropyridazin-3-yl)-2-isopropylpyrazolo[1,5-a]pyridine | CHEMBL1779440
TypeSmall organic molecule
Emp. Form.C14H13ClN4
Mol. Mass.272.733
SMILESCC(C)c1nn2ccccc2c1-c1ccc(Cl)nn1