Reaction Details
TargetcGMP-inhibited 3',5'-cyclic phosphodiesterase 3A
LigandBDBM50344326
Substrate/Competitorn/a
Meas. Tech.ChEMBL_748498 (CHEMBL1780351)
IC50 2750±n/a nM
Citation Allcock, RWBlakli, HJiang, ZJohnston, KAMorgan, KMRosair, GMIwase, KKohno, YAdams, DR Phosphodiesterase inhibitors. Part 1: Synthesis and structure-activity relationships of pyrazolopyridine-pyridazinone PDE inhibitors developed from ibudilast. Bioorg Med Chem Lett21:3307-12 (2011) 
 
cGMP-inhibited 3',5'-cyclic phosphodiesterase 3A
Name:cGMP-inhibited 3',5'-cyclic phosphodiesterase 3A
Type:Enzyme
Mol. Mass.:124966.46
Organism:Homo sapiens (Human)
Description:Q14432
Residue:1141
BDBM50344326
NameBDBM50344326
Synonyms:6-(2-isopropyl-7-methoxypyrazolo[1,5-a]pyridin-4-yl)pyridazin-3(2H)-one | CHEMBL1779444
TypeSmall organic molecule
Emp. Form.C15H16N4O2
Mol. Mass.284.3131
SMILESCOc1ccc(-c2ccc(=O)[nH]n2)c2cc(nn12)C(C)C