Reaction Details
TargetSigma non-opioid intracellular receptor 1
LigandBDBM50026868
Substrate/Competitorn/a
Meas. Tech.ChEMBL_748646 (CHEMBL1780499)
Ki 15000±n/a nM
Citation Rack, EFröhlich, RSchepmann, DWünsch, B Design, synthesis and pharmacological evaluation of spirocyclics(1) receptor ligands with exocyclic amino moiety (increased distance 1). Bioorg Med Chem19:3141-51 (2011) 
 
Sigma non-opioid intracellular receptor 1
Name:Sigma non-opioid intracellular receptor 1
Type:Protein
Mol. Mass.:25307.17
Organism:Cavia porcellus (Guinea pig)
Description:Q60492
Residue:223
BDBM50026868
NameBDBM50026868
Synonyms:2-(1H-indol-3-yl)-N,N-dimethylethanamine 3-(2-dimethylaminoethyl)indole CHEMBL12420 N,N-dimethyl-1H-indole-3-ethylamine WO2023019367, Compound DMT
TypeSmall organic molecule
Emp. Form.C12H16N2
Mol. Mass.188.2688
SMILESCN(C)CCc1c[nH]c2ccccc12