Reaction Details
TargetSigma non-opioid intracellular receptor 1
LigandBDBM50344436
Substrate/Competitorn/a
Meas. Tech.ChEMBL_748646 (CHEMBL1780499)
Ki 24±n/a nM
Citation Rack, EFröhlich, RSchepmann, DWünsch, B Design, synthesis and pharmacological evaluation of spirocyclics(1) receptor ligands with exocyclic amino moiety (increased distance 1). Bioorg Med Chem19:3141-51 (2011) 
 
Sigma non-opioid intracellular receptor 1
Name:Sigma non-opioid intracellular receptor 1
Type:Protein
Mol. Mass.:25307.17
Organism:Cavia porcellus (Guinea pig)
Description:Q60492
Residue:223
BDBM50344436
NameBDBM50344436
Synonyms:CHEMBL1780000 | cis-N-Benzyl-3-methoxy-N-methyl-3,4-dihydrospiro-[[2]benzopyran-1,1'-cyclohexan]-4'-amine
TypeSmall organic molecule
Emp. Form.C23H29NO2
Mol. Mass.351.4819
SMILESCOC1Cc2ccccc2[C@]2(CC[C@@H](CC2)N(C)Cc2ccccc2)O1