Reaction Details
TargetSodium channel protein type 9 subunit alpha
LigandBDBM50344869
Substrate/Competitorn/a
Meas. Tech.ChEMBL_749248 (CHEMBL1781191)
IC50 3±n/a nM
Citation Chowdhury, SChafeev, MLiu, SSun, JRaina, VChui, RYoung, WKwan, RFu, JCadieux, JA Discovery of XEN907, a spirooxindole blocker of NaV1.7 for the treatment of pain. Bioorg Med Chem Lett21:3676-81 (2011) 
 
Sodium channel protein type 9 subunit alpha
Name:Sodium channel protein type 9 subunit alpha
Type:Protein
Mol. Mass.:226375.97
Organism:Homo sapiens (Human)
Description:Q15858
Residue:1988
BDBM50344869
NameBDBM50344869
Synonyms:1'-pentyl-6H-spiro[benzofuro[6,5-d][1,3]dioxole-7,3'-indolin]-2'-one | CHEMBL1780061
TypeSmall organic molecule
Emp. Form.C21H21NO4
Mol. Mass.351.3957
SMILESCCCCCN1C(=O)C2(COc3cc4OCOc4cc23)c2ccccc12