Reaction Details
TargetCarbonic anhydrase 1
LigandBDBM26979
Substrate/Competitorn/a
Meas. Tech.ChEMBL_748877 (CHEMBL1781041)
pH8.3±n/a
Ki 6000000±n/a nM
Commentsextracted
Citation Vullo, DNishimori, IMinakuchi, TScozzafava, ASupuran, CT Inhibition studies with anions and small molecules of two novel β-carbonic anhydrases from the bacterial pathogen Salmonella enterica serovar Typhimurium. Bioorg Med Chem Lett21:3591-5 (2011) 
 
Carbonic anhydrase 1
Name:Carbonic anhydrase 1
Type:Enzyme
Mol. Mass.:28873.37
Organism:Homo sapiens (Human)
Description:P00915
Residue:261
BDBM26979
NameBDBM26979
Synonyms:CHEMBL69710 POTASSIUM CHLORIDE chloride | chloride ion
TypeIon
Emp. Form.Cl
Mol. Mass.35.454
SMILES[Cl-]