Reaction Details
TargetCarbonic anhydrase 2
LigandBDBM50344898
Substrate/Competitorn/a
Meas. Tech.ChEMBL_748879 (CHEMBL1781043)
pH8.3±n/a
Ki 690000±n/a nM
Commentsextracted
Citation Vullo, DNishimori, IMinakuchi, TScozzafava, ASupuran, CT Inhibition studies with anions and small molecules of two novel β-carbonic anhydrases from the bacterial pathogen Salmonella enterica serovar Typhimurium. Bioorg Med Chem Lett21:3591-5 (2011) 
 
Carbonic anhydrase 2
Name:Carbonic anhydrase 2
Type:Enzyme
Mol. Mass.:29250.71
Organism:Homo sapiens (Human)
Description:P00918
Residue:260
BDBM50344898
NameBDBM50344898
Synonyms:CHEMBL1081267 | sodium perruthenate
TypeSmall organic molecule
Emp. Form.O4Ru
Mol. Mass.165.07
SMILESO=[Ru-](=O)(=O)=O