Reaction Details
TargetSqualene synthase
LigandBDBM50344969
Substrate/Competitorn/a
Meas. Tech.ChEMBL_749032 (CHEMBL1781817)
IC50 56±n/a nM
Citation Griebenow, NBuchmueller, AKolkhof, PSchamberger, JBischoff, H Identification of 4H,6H-[2]benzoxepino[4,5-c][1,2]oxazoles as novel squalene synthase inhibitors. Bioorg Med Chem Lett21:3648-53 (2011) 
 
Squalene synthase
Name:Squalene synthase
Type:PROTEIN
Mol. Mass.:48114.76
Organism:Homo sapiens (Human)
Description:ChEMBL_1352847
Residue:417
BDBM50344969
NameBDBM50344969
Synonyms:CHEMBL1778340 | [(4R,6S)-8-Chloro-6-(2,3-dimethoxy-phenyl)-1-isopropyl-4H,6H-2,5-dioxa-3-aza-benzo[e]azulen-4-yl]-acetic acid
TypeSmall organic molecule
Emp. Form.C24H24ClNO6
Mol. Mass.457.903
SMILESCOc1cccc([C@H]2O[C@H](CC(O)=O)c3noc(C(C)C)c3-c3ccc(Cl)cc23)c1OC