Reaction Details
TargetCarbonic anhydrase 1
LigandBDBM16649
Substrate/Competitorn/a
Meas. Tech.ChEMBL_751964 (CHEMBL1785906)
Ki 5900±n/a nM
Citation Hen, NBialer, MYagen, BMaresca, AAggarwal, MRobbins, AHMcKenna, RScozzafava, ASupuran, CT Anticonvulsant 4-aminobenzenesulfonamide derivatives with branched-alkylamide moieties: X-ray crystallography and inhibition studies of human carbonic anhydrase isoforms I, II, VII, and XIV. J Med Chem54:3977-81 (2011) 
 
Carbonic anhydrase 1
Name:Carbonic anhydrase 1
Type:Enzyme
Mol. Mass.:28873.37
Organism:Homo sapiens (Human)
Description:P00915
Residue:261
BDBM16649
NameBDBM16649
Synonyms:2,2-dimethyl-N-(4-sulfamoylphenyl)propanamide CHEMBL23285 | aromatic sulfonamide compound 14
TypeSmall organic molecule
Emp. Form.C11H16N2O3S
Mol. Mass.256.321
SMILESCC(C)(C)C(=O)Nc1ccc(cc1)S(N)(=O)=O