Reaction Details
TargetFibroblast growth factor receptor 3
LigandBDBM50345444
Substrate/Competitorn/a
Meas. Tech.ChEMBL_751988 (CHEMBL1785930)
IC50 4600±n/a nM
Citation Chen, ZWang, XZhu, WCao, XTong, LLi, HXie, HXu, YTan, SKuang, DDing, JQian, X Acenaphtho[1,2-b]pyrrole-based selective fibroblast growth factor receptors 1 (FGFR1) inhibitors: design, synthesis, and biological activity. J Med Chem54:3732-45 (2011) 
 
Fibroblast growth factor receptor 3
Name:Fibroblast growth factor receptor 3
Type:Protein
Mol. Mass.:87699.57
Organism:Homo sapiens (Human)
Description:P22607
Residue:806
BDBM50345444
NameBDBM50345444
Synonyms:CHEMBL1784725 | Ethyl 8-oxo-8H-acenaphtho[1,2-b]pyrrole-9-carboxylate
TypeSmall organic molecule
Emp. Form.C17H11NO3
Mol. Mass.277.2741
SMILESCCOC(=O)c1c2c3cccc4cccc(c2nc1=O)c34