Reaction Details
TargetFibroblast growth factor receptor 1
LigandBDBM50345465
Substrate/Competitorn/a
Meas. Tech.ChEMBL_751986 (CHEMBL1785928)
IC50>10000±n/a nM
Citation Chen, ZWang, XZhu, WCao, XTong, LLi, HXie, HXu, YTan, SKuang, DDing, JQian, X Acenaphtho[1,2-b]pyrrole-based selective fibroblast growth factor receptors 1 (FGFR1) inhibitors: design, synthesis, and biological activity. J Med Chem54:3732-45 (2011) 
 
Fibroblast growth factor receptor 1
Name:Fibroblast growth factor receptor 1
Type:Receptor
Mol. Mass.:91861.70
Organism:Homo sapiens (Human)
Description:P11362
Residue:822
BDBM50345465
NameBDBM50345465
Synonyms:Allyl 8-Oxo-3-(propylthio)-8H-acenaphtho[1,2-b]pyrrole-9-carboxylate | CHEMBL1784737
TypeSmall organic molecule
Emp. Form.C21H17NO3S
Mol. Mass.363.43
SMILESCCCSc1ccc2c3c(C(=O)OCC=C)c(=O)nc3c3cccc1c23