Reaction Details
TargetP2Y purinoceptor 2
LigandBDBM50199176
Substrate/Competitorn/a
Meas. Tech.ChEMBL_751013 (CHEMBL1786668)
EC50 35±n/a nM
Citation Maruoka, HJayasekara, MPBarrett, MOFranklin, DAde Castro, SKim, NCostanzi, SHarden, TKJacobson, KA Pyrimidine nucleotides with 4-alkyloxyimino and terminal tetraphosphated-ester modifications as selective agonists of the P2Y(4) receptor. J Med Chem54:4018-33 (2011) 
 
P2Y purinoceptor 2
Name:P2Y purinoceptor 2
Type:PROTEIN
Mol. Mass.:42299.21
Organism:Homo sapiens (Human)
Description:ChEMBL_1455361
Residue:377
BDBM50199176
NameBDBM50199176
Synonyms:2-thio-1-beta-D-ribofuranosyl(3H)pyrimidine-2,4-dione 5'-triphosphate | CHEMBL217803
TypeSmall organic molecule
Emp. Form.C9H15N2O14P3S
Mol. Mass.500.207
SMILESO[C@H]1[C@@H](O)[C@@H](O[C@@H]1COP(O)(=O)OP(O)(=O)OP(O)(O)=O)n1ccc(=O)[nH]c1=S