Reaction Details
TargetP2Y purinoceptor 4
LigandBDBM50319143
Substrate/Competitorn/a
Meas. Tech.ChEMBL_751027 (CHEMBL1786812)
EC50 25±n/a nM
Citation Maruoka, HJayasekara, MPBarrett, MOFranklin, DAde Castro, SKim, NCostanzi, SHarden, TKJacobson, KA Pyrimidine nucleotides with 4-alkyloxyimino and terminal tetraphosphated-ester modifications as selective agonists of the P2Y(4) receptor. J Med Chem54:4018-33 (2011) 
 
P2Y purinoceptor 4
Name:P2Y purinoceptor 4
Type:PROTEIN
Mol. Mass.:40977.17
Organism:Homo sapiens (Human)
Description:ChEMBL_751027
Residue:365
BDBM50319143
NameBDBM50319143
Synonyms:CHEMBL1083764 N4-Methoxycytidine 5'-Triphosphate triethylammonium Salt
TypeSmall organic molecule
Emp. Form.C10H18N3O15P3
Mol. Mass.513.1823
SMILESCONc1ccn([C@@H]2O[C@H](COP(O)(=O)OP(O)(=O)OP(O)(O)=O)[C@@H](O)[C@H]2O)c(=O)n1