Reaction Details
TargetP2Y purinoceptor 4
LigandBDBM50345484
Substrate/Competitorn/a
Meas. Tech.ChEMBL_751027 (CHEMBL1786812)
EC50 97±n/a nM
Citation Maruoka, HJayasekara, MPBarrett, MOFranklin, DAde Castro, SKim, NCostanzi, SHarden, TKJacobson, KA Pyrimidine nucleotides with 4-alkyloxyimino and terminal tetraphosphated-ester modifications as selective agonists of the P2Y(4) receptor. J Med Chem54:4018-33 (2011) 
 
P2Y purinoceptor 4
Name:P2Y purinoceptor 4
Type:PROTEIN
Mol. Mass.:40977.17
Organism:Homo sapiens (Human)
Description:ChEMBL_751027
Residue:365
BDBM50345484
NameBDBM50345484
Synonyms:CHEMBL1784892 | N4-Benzyloxycytidine-5'-triphosphate
TypeSmall organic molecule
Emp. Form.C16H22N3O15P3
Mol. Mass.589.2783
SMILESO[C@@H]1[C@@H](COP(O)(=O)OP(O)(=O)OP(O)(O)=O)O[C@H]([C@@H]1O)n1ccc(NOCc2ccccc2)nc1=O