Reaction Details
TargetA disintegrin and metalloproteinase with thrombospondin motifs 5
LigandBDBM50345534
Substrate/Competitorn/a
Meas. Tech.ChEMBL_751101 (CHEMBL1787038)
IC50 950±n/a nM
Citation De Savi, CPape, ASawyer, YMilne, DDavies, CCumming, JGTing, ALamont, SSmith, PDTart, JPage, KMoore, P Orally active achiral N-hydroxyformamide inhibitors of ADAM-TS4 (aggrecanase-1) and ADAM-TS5 (aggrecanase-2) for the treatment of osteoarthritis. Bioorg Med Chem Lett21:3301-6 (2011) 
 
A disintegrin and metalloproteinase with thrombospondin motifs 5
Name:A disintegrin and metalloproteinase with thrombospondin motifs 5
Type:Enzyme
Mol. Mass.:101769.09
Organism:Homo sapiens (Human)
Description:Q9UNA0
Residue:930
BDBM50345534
NameBDBM50345534
Synonyms:CHEMBL1784359 US10322143, Compound 13b
TypeSmall organic molecule
Emp. Form.C24H36N2O7S2
Mol. Mass.528.682
SMILESCS(=O)(=O)c1ccc(CCC2CCN(CC2)S(=O)(=O)CC2(CCOCC2)N(O)C=O)c(c1)C1CC1