Reaction Details
TargetA disintegrin and metalloproteinase with thrombospondin motifs 4
LigandBDBM50345523
Substrate/Competitorn/a
Meas. Tech.ChEMBL_751100 (CHEMBL1787037)
IC50 24±n/a nM
Citation De Savi, CPape, ASawyer, YMilne, DDavies, CCumming, JGTing, ALamont, SSmith, PDTart, JPage, KMoore, P Orally active achiral N-hydroxyformamide inhibitors of ADAM-TS4 (aggrecanase-1) and ADAM-TS5 (aggrecanase-2) for the treatment of osteoarthritis. Bioorg Med Chem Lett21:3301-6 (2011) 
 
A disintegrin and metalloproteinase with thrombospondin motifs 4
Name:A disintegrin and metalloproteinase with thrombospondin motifs 4
Type:Enzyme
Mol. Mass.:90214.54
Organism:Homo sapiens (Human)
Description:O75173
Residue:837
BDBM50345523
NameBDBM50345523
Synonyms:CHEMBL1784348 | N-(1-acetyl-4-((4-(2-(3,5-dimethylisoxazol-4-yl)ethyl)piperidin-1-ylsulfonyl)methyl)piperidin-4-yl)-N-hydroxyformamide
TypeSmall organic molecule
Emp. Form.C21H34N4O6S
Mol. Mass.470.583
SMILESCC(=O)N1CCC(CS(=O)(=O)N2CCC(CCc3c(C)noc3C)CC2)(CC1)N(O)C=O