Reaction Details
TargetA disintegrin and metalloproteinase with thrombospondin motifs 5
LigandBDBM50345522
Substrate/Competitorn/a
Meas. Tech.ChEMBL_751101 (CHEMBL1787038)
IC50 270±n/a nM
Citation De Savi, CPape, ASawyer, YMilne, DDavies, CCumming, JGTing, ALamont, SSmith, PDTart, JPage, KMoore, P Orally active achiral N-hydroxyformamide inhibitors of ADAM-TS4 (aggrecanase-1) and ADAM-TS5 (aggrecanase-2) for the treatment of osteoarthritis. Bioorg Med Chem Lett21:3301-6 (2011) 
 
A disintegrin and metalloproteinase with thrombospondin motifs 5
Name:A disintegrin and metalloproteinase with thrombospondin motifs 5
Type:Enzyme
Mol. Mass.:101769.09
Organism:Homo sapiens (Human)
Description:Q9UNA0
Residue:930
BDBM50345522
NameBDBM50345522
Synonyms:CHEMBL1784347 US10322143, Compound 14g
TypeSmall organic molecule
Emp. Form.C19H31N3O7S2
Mol. Mass.477.595
SMILESCc1noc(C)c1CCC1CCN(CC1)S(=O)(=O)CC1(CCS(=O)(=O)CC1)N(O)C=O