Reaction Details
TargetInterstitial collagenase
LigandBDBM50345504
Substrate/Competitorn/a
Meas. Tech.ChEMBL_751104 (CHEMBL1787041)
IC50>10000±n/a nM
Citation De Savi, CPape, ASawyer, YMilne, DDavies, CCumming, JGTing, ALamont, SSmith, PDTart, JPage, KMoore, P Orally active achiral N-hydroxyformamide inhibitors of ADAM-TS4 (aggrecanase-1) and ADAM-TS5 (aggrecanase-2) for the treatment of osteoarthritis. Bioorg Med Chem Lett21:3301-6 (2011) 
 
Interstitial collagenase
Name:Interstitial collagenase
Type:Enzyme
Mol. Mass.:54010.26
Organism:Homo sapiens (Human)
Description: P03956
Residue:469
BDBM50345504
NameBDBM50345504
Synonyms:CHEMBL1784360 US10322143, Compound 13c
TypeSmall organic molecule
Emp. Form.C22H34N2O7S2
Mol. Mass.502.645
SMILESCc1cc(ccc1CCC1CCN(CC1)S(=O)(=O)CC1(CCOCC1)N(O)C=O)S(C)(=O)=O