Reaction Details
TargetInterstitial collagenase
LigandBDBM50345513
Substrate/Competitorn/a
Meas. Tech.ChEMBL_751104 (CHEMBL1787041)
IC50>10000±n/a nM
Citation De Savi, CPape, ASawyer, YMilne, DDavies, CCumming, JGTing, ALamont, SSmith, PDTart, JPage, KMoore, P Orally active achiral N-hydroxyformamide inhibitors of ADAM-TS4 (aggrecanase-1) and ADAM-TS5 (aggrecanase-2) for the treatment of osteoarthritis. Bioorg Med Chem Lett21:3301-6 (2011) 
 
Interstitial collagenase
Name:Interstitial collagenase
Type:Enzyme
Mol. Mass.:54010.26
Organism:Homo sapiens (Human)
Description: P03956
Residue:469
BDBM50345513
NameBDBM50345513
Synonyms:CHEMBL1784338 US10322143, Compound 13l
TypeSmall organic molecule
Emp. Form.C21H33N3O5S
Mol. Mass.439.569
SMILESCc1cc(CCC2CCN(CC2)S(=O)(=O)CC2(CCOCC2)N(O)C=O)c(C)cn1