Reaction Details
TargetInterstitial collagenase
LigandBDBM50345534
Substrate/Competitorn/a
Meas. Tech.ChEMBL_751104 (CHEMBL1787041)
IC50>10000±n/a nM
Citation De Savi, CPape, ASawyer, YMilne, DDavies, CCumming, JGTing, ALamont, SSmith, PDTart, JPage, KMoore, P Orally active achiral N-hydroxyformamide inhibitors of ADAM-TS4 (aggrecanase-1) and ADAM-TS5 (aggrecanase-2) for the treatment of osteoarthritis. Bioorg Med Chem Lett21:3301-6 (2011) 
 
Interstitial collagenase
Name:Interstitial collagenase
Type:Enzyme
Mol. Mass.:54010.26
Organism:Homo sapiens (Human)
Description: P03956
Residue:469
BDBM50345534
NameBDBM50345534
Synonyms:CHEMBL1784359 US10322143, Compound 13b
TypeSmall organic molecule
Emp. Form.C24H36N2O7S2
Mol. Mass.528.682
SMILESCS(=O)(=O)c1ccc(CCC2CCN(CC2)S(=O)(=O)CC2(CCOCC2)N(O)C=O)c(c1)C1CC1