Reaction Details
TargetCollagenase 3
LigandBDBM50345533
Substrate/Competitorn/a
Meas. Tech.ChEMBL_751102 (CHEMBL1787039)
IC50 780±n/a nM
Citation De Savi, CPape, ASawyer, YMilne, DDavies, CCumming, JGTing, ALamont, SSmith, PDTart, JPage, KMoore, P Orally active achiral N-hydroxyformamide inhibitors of ADAM-TS4 (aggrecanase-1) and ADAM-TS5 (aggrecanase-2) for the treatment of osteoarthritis. Bioorg Med Chem Lett21:3301-6 (2011) 
 
Collagenase 3
Name:Collagenase 3
Type:Enzyme
Mol. Mass.:53808.06
Organism:Homo sapiens (Human)
Description:P45452
Residue:471
BDBM50345533
NameBDBM50345533
Synonyms:CHEMBL1784358 US10322143, Compound 13a
TypeSmall organic molecule
Emp. Form.C21H31ClN2O5S
Mol. Mass.458.999
SMILESCc1cc(Cl)ccc1CCC1CCN(CC1)S(=O)(=O)CC1(CCOCC1)N(O)C=O