Reaction Details
Target72 kDa type IV collagenase
LigandBDBM50345507
Substrate/Competitorn/a
Meas. Tech.ChEMBL_751107 (CHEMBL1787044)
IC50 620±n/a nM
Citation De Savi, CPape, ASawyer, YMilne, DDavies, CCumming, JGTing, ALamont, SSmith, PDTart, JPage, KMoore, P Orally active achiral N-hydroxyformamide inhibitors of ADAM-TS4 (aggrecanase-1) and ADAM-TS5 (aggrecanase-2) for the treatment of osteoarthritis. Bioorg Med Chem Lett21:3301-6 (2011) 
 
72 kDa type IV collagenase
Name:72 kDa type IV collagenase
Type:Enzyme
Mol. Mass.:73870.36
Organism:Homo sapiens (Human)
Description: P08253
Residue:660
BDBM50345507
NameBDBM50345507
Synonyms:CHEMBL1784363 US10322143, Compound 13f
TypeSmall organic molecule
Emp. Form.C21H32N2O5S
Mol. Mass.424.554
SMILESCc1ccccc1CCC1CCN(CC1)S(=O)(=O)CC1(CCOCC1)N(O)C=O