Reaction Details
TargetMetabotropic glutamate receptor 5
LigandBDBM50258612
Substrate/Competitorn/a
Meas. Tech.ChEMBL_751566 (CHEMBL1787492)
IC50 1.89±n/a nM
Citation Alagille, DDaCosta, HChen, YHemstapat, KRodriguez, ABaldwin, RMConn, JPTamagnan, GD Potent mGluR5 antagonists: pyridyl and thiazolyl-ethynyl-3,5-disubstituted-phenyl series. Bioorg Med Chem Lett21:3243-7 (2011) 
 
Metabotropic glutamate receptor 5
Name:Metabotropic glutamate receptor 5
Type:Enzyme
Mol. Mass.:131900.14
Organism:Rattus norvegicus (Rat)
Description:P31424
Residue:1203
BDBM50258612
NameBDBM50258612
Synonyms:3-Fluoro-5-cyano-1-(2-methylthiazol-4-ylethynyl)benzene | CHEMBL446543
TypeSmall organic molecule
Emp. Form.C13H7FN2S
Mol. Mass.242.271
SMILESCc1nc(cs1)C#Cc1cc(F)cc(c1)C#N