Reaction Details
TargetTyrosine-protein phosphatase non-receptor type 1
LigandBDBM50345576
Substrate/Competitorn/a
Meas. Tech.ChEMBL_751575 (CHEMBL1787636)
IC50 39670±n/a nM
Citation Piao, SJZhang, HJLu, HYYang, FJiao, WHYi, YHChen, WSLin, HW Hippolides A-H, acyclic manoalide derivatives from the marine sponge Hippospongia lachne. J Nat Prod74:1248-54 (2011) 
 
Tyrosine-protein phosphatase non-receptor type 1
Name:Tyrosine-protein phosphatase non-receptor type 1
Type:Protein phosphatase
Mol. Mass.:49963.76
Organism:Homo sapiens (Human)
Description:Human recombinant GST-fusion PTP1B (1-435).
Residue:435
BDBM50345576
NameBDBM50345576
Synonyms:CHEMBL1784622 | Hippolide B
TypeSmall organic molecule
Emp. Form.C26H39NO4
Mol. Mass.429.5922
SMILES[#6]-[#8]-[#6@H]-1-[#8]-[#6@H](-[#6]-[#6]=[#6]-1-[#6]-[#6]\[#6]=[#6](/[#6])-[#6]-[#6]\[#6]=[#6](/[#6])-[#6]-[#6]\[#6]=[#6](\[#6])-[#6])-[#6@@H]-1-[#6]-[#6](=O)-[#7]-[#6]-1=O