Reaction Details
TargetTyrosine-protein phosphatase non-receptor type 1
LigandBDBM50345577
Substrate/Competitorn/a
Meas. Tech.ChEMBL_751575 (CHEMBL1787636)
IC50 23810±n/a nM
Citation Piao, SJZhang, HJLu, HYYang, FJiao, WHYi, YHChen, WSLin, HW Hippolides A-H, acyclic manoalide derivatives from the marine sponge Hippospongia lachne. J Nat Prod74:1248-54 (2011) 
 
Tyrosine-protein phosphatase non-receptor type 1
Name:Tyrosine-protein phosphatase non-receptor type 1
Type:Protein phosphatase
Mol. Mass.:49963.76
Organism:Homo sapiens (Human)
Description:Human recombinant GST-fusion PTP1B (1-435).
Residue:435
BDBM50345577
NameBDBM50345577
Synonyms:CHEMBL1782082 | Hippolide A
TypeSmall organic molecule
Emp. Form.C25H37NO4
Mol. Mass.415.5656
SMILES[#6]\[#6](-[#6])=[#6]\[#6]-[#6]\[#6](-[#6])=[#6]\[#6]-[#6]\[#6](-[#6])=[#6]\[#6]-[#6]-[#6]-1=[#6]-[#6]-[#6@@H](-[#8]-[#6@@H]-1-[#8])-[#6@@H]-1-[#6]-[#6](=O)-[#7]-[#6]-1=O