Reaction Details
TargetCarbonic anhydrase 2
LigandBDBM35736
Substrate/Competitorn/a
Meas. Tech.ChEMBL_750105 (CHEMBL1787522)
Ki 61±n/a nM
Citation Güzel, OInnocenti, AScozzafava, ASalman, ASupuran, CT Carbonic anhydrase inhibitors. Phenacetyl-, pyridylacetyl- and thienylacetyl-substituted aromatic sulfonamides act as potent and selective isoform VII inhibitors. Bioorg Med Chem Lett19:3170-3 (2009) 
 
Carbonic anhydrase 2
Name:Carbonic anhydrase 2
Type:Enzyme
Mol. Mass.:29250.71
Organism:Homo sapiens (Human)
Description:P00918
Residue:260
BDBM35736
NameBDBM35736
Synonyms:sulfonamide deriv., 7d
TypeSmall organic molecule
Emp. Form.C14H13FN2O3S
Mol. Mass.308.328
SMILESNS(=O)(=O)c1ccc(NC(=O)Cc2ccccc2)c(F)c1