Reaction Details
TargetCarbonic anhydrase 2
LigandBDBM35731
Substrate/Competitorn/a
Meas. Tech.ChEMBL_750105 (CHEMBL1787522)
Ki 53±n/a nM
Citation Güzel, OInnocenti, AScozzafava, ASalman, ASupuran, CT Carbonic anhydrase inhibitors. Phenacetyl-, pyridylacetyl- and thienylacetyl-substituted aromatic sulfonamides act as potent and selective isoform VII inhibitors. Bioorg Med Chem Lett19:3170-3 (2009) 
 
Carbonic anhydrase 2
Name:Carbonic anhydrase 2
Type:Enzyme
Mol. Mass.:29250.71
Organism:Homo sapiens (Human)
Description:P00918
Residue:260
BDBM35731
NameBDBM35731
Synonyms:sulfonamide deriv., 5f
TypeSmall organic molecule
Emp. Form.C14H16N2O3S2
Mol. Mass.324.418
SMILESNS(=O)(=O)c1ccc(CCNC(=O)Cc2cccs2)cc1