Reaction Details
TargetCarbonic anhydrase 1
LigandBDBM35738
Substrate/Competitorn/a
Meas. Tech.ChEMBL_750104 (CHEMBL1787521)
Ki 263±n/a nM
Citation Güzel, OInnocenti, AScozzafava, ASalman, ASupuran, CT Carbonic anhydrase inhibitors. Phenacetyl-, pyridylacetyl- and thienylacetyl-substituted aromatic sulfonamides act as potent and selective isoform VII inhibitors. Bioorg Med Chem Lett19:3170-3 (2009) 
 
Carbonic anhydrase 1
Name:Carbonic anhydrase 1
Type:Enzyme
Mol. Mass.:28873.37
Organism:Homo sapiens (Human)
Description:P00915
Residue:261
BDBM35738
NameBDBM35738
Synonyms:sulfonamide deriv., 7f
TypeSmall organic molecule
Emp. Form.C14H13BrN2O3S
Mol. Mass.369.234
SMILESNS(=O)(=O)c1ccc(NC(=O)Cc2ccccc2)c(Br)c1