Reaction Details
TargetCarbonic anhydrase 1
LigandBDBM35735
Substrate/Competitorn/a
Meas. Tech.ChEMBL_750104 (CHEMBL1787521)
Ki 60±n/a nM
Citation Güzel, OInnocenti, AScozzafava, ASalman, ASupuran, CT Carbonic anhydrase inhibitors. Phenacetyl-, pyridylacetyl- and thienylacetyl-substituted aromatic sulfonamides act as potent and selective isoform VII inhibitors. Bioorg Med Chem Lett19:3170-3 (2009) 
 
Carbonic anhydrase 1
Name:Carbonic anhydrase 1
Type:Enzyme
Mol. Mass.:28873.37
Organism:Homo sapiens (Human)
Description:P00915
Residue:261
BDBM35735
NameBDBM35735
Synonyms:sulfonamide deriv., 7c
TypeSmall organic molecule
Emp. Form.C16H18N2O3S
Mol. Mass.318.391
SMILESNS(=O)(=O)c1ccc(CCNC(=O)Cc2ccccc2)cc1