Reaction Details
TargetCarbonic anhydrase 1
LigandBDBM35727
Substrate/Competitorn/a
Meas. Tech.ChEMBL_750104 (CHEMBL1787521)
Ki 161±n/a nM
Citation Güzel, OInnocenti, AScozzafava, ASalman, ASupuran, CT Carbonic anhydrase inhibitors. Phenacetyl-, pyridylacetyl- and thienylacetyl-substituted aromatic sulfonamides act as potent and selective isoform VII inhibitors. Bioorg Med Chem Lett19:3170-3 (2009) 
 
Carbonic anhydrase 1
Name:Carbonic anhydrase 1
Type:Enzyme
Mol. Mass.:28873.37
Organism:Homo sapiens (Human)
Description:P00915
Residue:261
BDBM35727
NameBDBM35727
Synonyms:sulfonamide deriv., 5b
TypeSmall organic molecule
Emp. Form.C12H11FN2O3S2
Mol. Mass.314.356
SMILESNS(=O)(=O)c1ccc(NC(=O)Cc2cccs2)c(F)c1