Reaction Details
TargetHexokinase-4
LigandBDBM50346026
Substrate/Competitorn/a
Meas. Tech.ChEMBL_750244 (CHEMBL1788085)
EC50 1420±n/a nM
Citation Pfefferkorn, JALou, JMinich, MLFilipski, KJHe, MZhou, RAhmed, SBenbow, JPerez, AGTu, MLitchfield, JSharma, RMetzler, KBourbonais, FHuang, CBeebe, DAOates, PJ Pyridones as glucokinase activators: identification of a unique metabolic liability of the 4-sulfonyl-2-pyridone heterocycle. Bioorg Med Chem Lett19:3247-52 (2009) 
 
Hexokinase-4
Name:Hexokinase-4
Type:Enzyme
Mol. Mass.:52175.81
Organism:Homo sapiens (Human)
Description:P35557
Residue:465
BDBM50346026
NameBDBM50346026
Synonyms:(R)-2-(3-chloro-4-(methylsulfonyl)phenyl)-3-((R)-3-oxocyclopentyl)-N-(pyrazin-2-yl)propanamide | CHEMBL1783734
TypeSmall organic molecule
Emp. Form.C19H20ClN3O4S
Mol. Mass.421.898
SMILESCS(=O)(=O)c1ccc(cc1Cl)[C@@H](C[C@H]1CCC(=O)C1)C(=O)Nc1cnccn1