Reaction Details
TargetExtracellular calcium-sensing receptor
LigandBDBM50346038
Substrate/Competitorn/a
Meas. Tech.ChEMBL_750427 (CHEMBL1785979)
IC50 350±n/a nM
Citation Balan, GBauman, JBhattacharya, SCastrodad, MHealy, DRHerr, MHumphries, PJennings, SKalgutkar, ASKapinos, BKhot, VLazarra, KLi, MLi, YNeagu, COliver, RPiotrowski, DWPrice, DQi, HSimmons, HASouthers, JWei, LZhang, YParalkar, VM The discovery of novel calcium sensing receptor negative allosteric modulators. Bioorg Med Chem Lett19:3328-32 (2009) 
 
Extracellular calcium-sensing receptor
Name:Extracellular calcium-sensing receptor
Type:Protein
Mol. Mass.:120663.13
Organism:Homo sapiens (Human)
Description:P41180
Residue:1078
BDBM50346038
NameBDBM50346038
Synonyms:6-(4-Cyano-3-{(R)-3-[1,1-dimethyl-2-(1-oxo-1,3-dihydro-isoindol-2-yl)-ethylamino]-2-hydroxy-propoxy}-phenyl)-tricyclo[3.2.1.0*2,4*]octane-3-carboxylic acid | CHEMBL1783932
TypeSmall organic molecule
Emp. Form.C31H35N3O5
Mol. Mass.529.6267
SMILESCC(C)(CN1Cc2ccccc2C1=O)NC[C@@H](O)COc1cc(ccc1C#N)C1CC2CC1C1C2C1C(O)=O