Reaction Details
TargetNeuronal acetylcholine receptor subunit alpha-7
LigandBDBM50346168
Substrate/Competitorn/a
Meas. Tech.ChEMBL_750693 (CHEMBL1785675)
Ki 5770±n/a nM
Citation Breining, SRBencherif, MGrady, SRWhiteaker, PMarks, MJWageman, CRLester, HAYohannes, D Evaluation of structurally diverse neuronal nicotinic receptor ligands for selectivity at the alpha6( *) subtype. Bioorg Med Chem Lett19:4359-63 (2009) 
 
Neuronal acetylcholine receptor subunit alpha-7
Name:Neuronal acetylcholine receptor subunit alpha-7
Type:PROTEIN
Mol. Mass.:56632.61
Organism:Mus musculus
Description:ChEMBL_144033
Residue:502
BDBM50346168
NameBDBM50346168
Synonyms:(R)-3-(pyrrolidin-2-ylethynyl)pyridine hemigalactarate CHEMBL1783878 CHEMBL1783880 | CHEMBL1783884
TypeSmall organic molecule
Emp. Form.C6H10O8
Mol. Mass.210.1388
SMILESO[C@@H]([C@@H](O)[C@H](O)C(O)=O)[C@@H](O)C(O)=O