Reaction Details
TargetNeuronal acetylcholine receptor subunit alpha-7
LigandBDBM50346174
Substrate/Competitorn/a
Meas. Tech.ChEMBL_750693 (CHEMBL1785675)
Ki 3160±n/a nM
Citation Breining, SRBencherif, MGrady, SRWhiteaker, PMarks, MJWageman, CRLester, HAYohannes, D Evaluation of structurally diverse neuronal nicotinic receptor ligands for selectivity at the alpha6( *) subtype. Bioorg Med Chem Lett19:4359-63 (2009) 
 
Neuronal acetylcholine receptor subunit alpha-7
Name:Neuronal acetylcholine receptor subunit alpha-7
Type:PROTEIN
Mol. Mass.:56632.61
Organism:Mus musculus
Description:ChEMBL_144033
Residue:502
BDBM50346174
NameBDBM50346174
Synonyms:(S)-3-(2-(pyrrolidin-3-yl)vinyl)pyridine bis(2,2,2-trifluoroacetate) | CHEMBL1783883
TypeSmall organic molecule
Emp. Form.C11H14N2
Mol. Mass.174.2423
SMILESC1C[C@H](CN1)\C=C\c1cccnc1