Reaction Details
TargetNeuronal acetylcholine receptor subunit alpha-7
LigandBDBM50346177
Substrate/Competitorn/a
Meas. Tech.ChEMBL_750693 (CHEMBL1785675)
Ki 1100±n/a nM
Citation Breining, SRBencherif, MGrady, SRWhiteaker, PMarks, MJWageman, CRLester, HAYohannes, D Evaluation of structurally diverse neuronal nicotinic receptor ligands for selectivity at the alpha6( *) subtype. Bioorg Med Chem Lett19:4359-63 (2009) 
 
Neuronal acetylcholine receptor subunit alpha-7
Name:Neuronal acetylcholine receptor subunit alpha-7
Type:PROTEIN
Mol. Mass.:56632.61
Organism:Mus musculus
Description:ChEMBL_144033
Residue:502
BDBM50346177
NameBDBM50346177
Synonyms:2-(pyrimidin-5-yl)quinuclidine bis(2,2,2-trifluoroacetate) | CHEMBL1783886
TypeSmall organic molecule
Emp. Form.C11H15N3
Mol. Mass.189.2569
SMILESC1CN2CCC1CC2c1cncnc1