Reaction Details
TargetCasein kinase I isoform alpha
LigandBDBM7287
Substrate/Competitorn/a
Meas. Tech.ChEMBL_749961 (CHEMBL1786938)
IC50>10000±n/a nM
Citation Power, DPLozach, OMeijer, LGrayson, DHConnon, SJ Concise synthesis and CDK/GSK inhibitory activity of the missing 9-azapaullones. Bioorg Med Chem Lett20:4940-4 (2010) 
 
Casein kinase I isoform alpha
Name:Casein kinase I isoform alpha
Type:PROTEIN
Mol. Mass.:14639.55
Organism:Sus scrofa
Description:ChEMBL_939731
Residue:125
BDBM7287
NameBDBM7287
Synonyms:8,18-diazatetracyclo[9.7.0.0^{2,7}.0^{12,17}]octadeca-1(11),2,4,6,12(17),13,15-heptaen-9-one NSC 641166 | Paullone
TypeSmall organic molecule
Emp. Form.C16H12N2O
Mol. Mass.248.2793
SMILESO=C1Cc2c([nH]c3ccccc23)-c2ccccc2N1