Reaction Details
TargetCasein kinase I isoform alpha
LigandBDBM50346236
Substrate/Competitorn/a
Meas. Tech.ChEMBL_749961 (CHEMBL1786938)
IC50>10000±n/a nM
Citation Power, DPLozach, OMeijer, LGrayson, DHConnon, SJ Concise synthesis and CDK/GSK inhibitory activity of the missing 9-azapaullones. Bioorg Med Chem Lett20:4940-4 (2010) 
 
Casein kinase I isoform alpha
Name:Casein kinase I isoform alpha
Type:PROTEIN
Mol. Mass.:14639.55
Organism:Sus scrofa
Description:ChEMBL_939731
Residue:125
BDBM50346236
NameBDBM50346236
Synonyms:9-Benzyl-6-oxo-5,6,7,12-tetrahydro-5,12-diaza-9-azonia-dibenzo[a,e]azulene bromide | CHEMBL1782169
TypeSmall organic molecule
Emp. Form.C22H18N3O
Mol. Mass.340.3973
SMILESO=C1Cc2c([nH+]c3ccn(Cc4ccccc4)cc23)-c2ccccc2N1