Reaction Details
TargetCaspase-3
LigandBDBM50326095
Substrate/Competitorn/a
Meas. Tech.ChEMBL_749585 (CHEMBL1787194)
IC50 30500±n/a nM
Citation Glória, PMCoutinho, IGonçalves, LMBaptista, CSoares, JNewton, ASMoreira, RSaraiva, LSantos, MM Aspartic vinyl sulfones: inhibitors of a caspase-3-dependent pathway. Eur J Med Chem46:2141-6 (2011) 
 
Caspase-3
Name:Caspase-3
Type:Hydrolase; heterotetramer of two heterodimers
Mol. Mass.:31607.55
Organism:Homo sapiens (Human)
Description:n/a
Residue:277
BDBM50326095
NameBDBM50326095
Synonyms:(S)-3-((2S,3S)-2-(benzyloxycarbonylamino)-3-methylpentanamido)-5-(methylsulfonyl)pent-4-enoic acid | CHEMBL1242700
TypeSmall organic molecule
Emp. Form.C20H28N2O7S
Mol. Mass.440.511
SMILESCC[C@H](C)[C@H](NC(=O)OCc1ccccc1)C(=O)N[C@@H](CC(O)=O)C=CS(C)(=O)=O