Reaction Details
Target5-hydroxytryptamine receptor 1A
LigandBDBM50011247
Substrate/Competitorn/a
Meas. Tech.ChEMBL_750218 (CHEMBL1787911)
Ki 0.8±n/a nM
Citation Fiorino, FMagli, EPerissutti, ESeverino, BFrecentese, FEsposito, ADe Angelis, FIncisivo, GMMassarelli, PNencini, CDi Gennaro, EBudillon, ADi Cintio, ASantagada, VCaliendo, G Synthesis of 1-naphtylpiperazine derivatives as serotoninergic ligands and their evaluation as antiproliferative agents. Eur J Med Chem46:2206-16 (2011) 
 
5-hydroxytryptamine receptor 1A
Name:5-hydroxytryptamine receptor 1A
Type:G Protein-Coupled Receptor (GPCR)
Mol. Mass.:46445.29
Organism:Rattus norvegicus (rat)
Description:Binding assays were performed using rat hippocampal membranes.
Residue:422
BDBM50011247
NameBDBM50011247
Synonyms:7-Dipropylamino-5,6,7,8-tetrahydro-naphthalen-1-ol; hydrobromide CHEMBL541621 | S-(-)-7-Dipropylamino-5,6,7,8-tetrahydro-naphthalen-1-ol
TypeSmall organic molecule
Emp. Form.C16H25NO
Mol. Mass.247.3758
SMILESCCCN(CCC)[C@H]1CCc2cccc(O)c2C1